Reaction Details
TargetcAMP-specific 3',5'-cyclic phosphodiesterase 7B
LigandBDBM50300953
Substrate/Competitorn/a
Meas. Tech.ChEMBL_597986 (CHEMBL1045417)
IC50>2000±n/a nM
Citation Hughes, ROWalker, JKRogier, DJHeasley, SEBlevis-Bal, RMBenson, AGJacobsen, EJCubbage, JWFobian, YMOwen, DRFreskos, JNMolyneaux, JMBrown, DLAcker, BAMaddux, TMTollefson, MBMoon, JBMischke, BVRumsey, JMZheng, YMacInnes, ABond, BRYu, Y Optimization of the aminopyridopyrazinones class of PDE5 inhibitors: discovery of 3-[(trans-4-hydroxycyclohexyl)amino]-7-(6-methoxypyridin-3-yl)-1-(2-propoxyethyl)pyrido[3,4-b]pyrazin-2(1H)-one. Bioorg Med Chem Lett19:5209-13 (2009) 
 
cAMP-specific 3',5'-cyclic phosphodiesterase 7B
Name:cAMP-specific 3',5'-cyclic phosphodiesterase 7B
Type:Enzyme
Mol. Mass.:51842.76
Organism:Homo sapiens (Human)
Description:Q9NP56
Residue:450
BDBM50300953
NameBDBM50300953
Synonyms:3-[(trans-4-hydroxycyclohexyl)amino]-7-(6-methoxypyridin-3-yl)-1-(2-propoxyethyl)pyrido[3,4-b]pyrazin-2(1H)-one | CHEMBL567470
TypeSmall organic molecule
Emp. Form.C24H31N5O4
Mol. Mass.453.534
SMILESCCCOCCn1c2cc(ncc2nc(N[C@H]2CC[C@H](O)CC2)c1=O)-c1ccc(OC)nc1