Reaction Details
TargetRod cGMP-specific 3',5'-cyclic phosphodiesterase subunit alpha
LigandBDBM50300978
Substrate/Competitorn/a
Meas. Tech.ChEMBL_597960 (CHEMBL1042745)
IC50 25±n/a nM
Citation Hughes, ROWalker, JKRogier, DJHeasley, SEBlevis-Bal, RMBenson, AGJacobsen, EJCubbage, JWFobian, YMOwen, DRFreskos, JNMolyneaux, JMBrown, DLAcker, BAMaddux, TMTollefson, MBMoon, JBMischke, BVRumsey, JMZheng, YMacInnes, ABond, BRYu, Y Optimization of the aminopyridopyrazinones class of PDE5 inhibitors: discovery of 3-[(trans-4-hydroxycyclohexyl)amino]-7-(6-methoxypyridin-3-yl)-1-(2-propoxyethyl)pyrido[3,4-b]pyrazin-2(1H)-one. Bioorg Med Chem Lett19:5209-13 (2009) 
 
Rod cGMP-specific 3',5'-cyclic phosphodiesterase subunit alpha
Name:Rod cGMP-specific 3',5'-cyclic phosphodiesterase subunit alpha
Type:PROTEIN
Mol. Mass.:99531.10
Organism:Homo sapiens (Human)
Description:ChEMBL_1347866
Residue:860
BDBM50300978
NameBDBM50300978
Synonyms:3-(2-(4-hydroxypiperidin-1-yl)-2-oxoethylamino)-7-(6-methoxypyridin-3-yl)-1-(2-propoxyethyl)pyrido[3,4-b]pyrazin-2(1H)-one | CHEMBL569264
TypeSmall organic molecule
Emp. Form.C25H32N6O5
Mol. Mass.496.5588
SMILESCCCOCCn1c2cc(ncc2nc(NCC(=O)N2CCC(O)CC2)c1=O)-c1ccc(OC)nc1