Reaction Details
TargetPotassium voltage-gated channel subfamily H member 2
LigandBDBM50301098
Substrate/Competitorn/a
Meas. Tech.ChEMBL_598542 (CHEMBL1043534)
IC50 5100±n/a nM
Citation Ando, MSekino, EHaga, YMoriya, MIto, MIto, JIwaasa, HIshihara, AKanatani, AOhtake, N Discovery of novel phenethylpyridone derivatives as potent melanin-concentrating hormone 1 receptor antagonists. Bioorg Med Chem Lett19:5186-90 (2009) 
 
Potassium voltage-gated channel subfamily H member 2
Name:Potassium voltage-gated channel subfamily H member 2
Type:Multi-pass membrane protein
Mol. Mass.:126672.65
Organism:Homo sapiens (Human)
Description:Q12809
Residue:1159
BDBM50301098
NameBDBM50301098
Synonyms:4-(4-fluorobenzyloxy)-1-(2-(5-((propylamino)methyl)pyridin-2-yl)ethyl)pyridin-2(1H)-one | CHEMBL565833
TypeSmall organic molecule
Emp. Form.C23H26FN3O2
Mol. Mass.395.4698
SMILESCCCNCc1ccc(CCn2ccc(OCc3ccc(F)cc3)cc2=O)nc1