Reaction Details
TargetTGF-beta receptor type-1
LigandBDBM50214864
Substrate/Competitorn/a
Meas. Tech.ChEMBL_598612 (CHEMBL1048115)
IC50 10±n/a nM
Citation Ren, JXLi, LLZou, JYang, LYang, JLYang, SY Pharmacophore modeling and virtual screening for the discovery of new transforming growth factor-beta type I receptor (ALK5) inhibitors. Eur J Med Chem44:4259-65 (2009) 
 
TGF-beta receptor type-1
Name:TGF-beta receptor type-1
Type:enzyme
Mol. Mass.:55968.24
Organism:Homo sapiens (Human)
Description:P36897
Residue:503
BDBM50214864
NameBDBM50214864
Synonyms:3-((5-(6-methylpyridin-2-yl)-4-(quinoxalin-6-yl)-1H-imidazol-2-yl)methylamino)benzamide | CHEMBL229599
TypeSmall organic molecule
Emp. Form.C25H21N7O
Mol. Mass.435.4805
SMILESCc1cccc(n1)-c1nc(CNc2cccc(c2)C(N)=O)[nH]c1-c1ccc2nccnc2c1