Reaction Details
TargetTGF-beta receptor type-1
LigandBDBM50301158
Substrate/Competitorn/a
Meas. Tech.ChEMBL_598612 (CHEMBL1048115)
IC50 6±n/a nM
Citation Ren, JXLi, LLZou, JYang, LYang, JLYang, SY Pharmacophore modeling and virtual screening for the discovery of new transforming growth factor-beta type I receptor (ALK5) inhibitors. Eur J Med Chem44:4259-65 (2009) 
 
TGF-beta receptor type-1
Name:TGF-beta receptor type-1
Type:enzyme
Mol. Mass.:55968.24
Organism:Homo sapiens (Human)
Description:P36897
Residue:503
BDBM50301158
NameBDBM50301158
Synonyms:4-(3-methylpyridin-2-yl)-5-(1,5-naphthyridin-2-yl)thiazol-2-amine | CHEMBL576062
TypeSmall organic molecule
Emp. Form.C17H13N5S
Mol. Mass.319.384
SMILESCc1cccnc1-c1nc(N)sc1-c1ccc2ncccc2n1