Reaction Details
TargetTGF-beta receptor type-1
LigandBDBM50301160
Substrate/Competitorn/a
Meas. Tech.ChEMBL_598612 (CHEMBL1048115)
IC50 24±n/a nM
Citation Ren, JXLi, LLZou, JYang, LYang, JLYang, SY Pharmacophore modeling and virtual screening for the discovery of new transforming growth factor-beta type I receptor (ALK5) inhibitors. Eur J Med Chem44:4259-65 (2009) 
 
TGF-beta receptor type-1
Name:TGF-beta receptor type-1
Type:enzyme
Mol. Mass.:55968.24
Organism:Homo sapiens (Human)
Description:P36897
Residue:503
BDBM50301160
NameBDBM50301160
Synonyms:4-((4-(3a,4-dihydrobenzo[d][1,3]dioxol-5-yl)-5-(6-methylpyridin-2-yl)-1H-imidazol-2-ylamino)methyl)benzonitrile | CHEMBL585667
TypeSmall organic molecule
Emp. Form.C24H21N5O2
Mol. Mass.411.4558
SMILESCc1cccc(n1)-c1nc(NCc2ccc(cc2)C#N)[nH]c1C1=CC=C2OCOC2C1