Reaction Details
TargetTGF-beta receptor type-1
LigandBDBM50132992
Substrate/Competitorn/a
Meas. Tech.ChEMBL_598612 (CHEMBL1048115)
IC50 31±n/a nM
Citation Ren, JXLi, LLZou, JYang, LYang, JLYang, SY Pharmacophore modeling and virtual screening for the discovery of new transforming growth factor-beta type I receptor (ALK5) inhibitors. Eur J Med Chem44:4259-65 (2009) 
 
TGF-beta receptor type-1
Name:TGF-beta receptor type-1
Type:enzyme
Mol. Mass.:55968.24
Organism:Homo sapiens (Human)
Description:P36897
Residue:503
BDBM50132992
NameBDBM50132992
Synonyms:4-(3-(6-methylpyridin-2-yl)-1H-pyrazol-4-yl)phenol CHEMBL118928
TypeSmall organic molecule
Emp. Form.C15H13N3O
Mol. Mass.251.2832
SMILESCc1cccc(n1)-c1n[nH]cc1-c1ccc(O)cc1