Reaction Details
TargetTGF-beta receptor type-1
LigandBDBM50151357
Substrate/Competitorn/a
Meas. Tech.ChEMBL_598612 (CHEMBL1048115)
IC50 19±n/a nM
Citation Ren, JXLi, LLZou, JYang, LYang, JLYang, SY Pharmacophore modeling and virtual screening for the discovery of new transforming growth factor-beta type I receptor (ALK5) inhibitors. Eur J Med Chem44:4259-65 (2009) 
 
TGF-beta receptor type-1
Name:TGF-beta receptor type-1
Type:enzyme
Mol. Mass.:55968.24
Organism:Homo sapiens (Human)
Description:P36897
Residue:503
BDBM50151357
NameBDBM50151357
Synonyms:2-(3-(pyridin-2-yl)-1H-pyrazol-4-yl)-1,5-naphthyridine CHEMBL183354
TypeSmall organic molecule
Emp. Form.C16H11N5
Mol. Mass.273.292
SMILESc1[nH]nc(c1-c1ccc2ncccc2n1)-c1ccccn1