Reaction Details
TargetTGF-beta receptor type-1
LigandBDBM50184873
Substrate/Competitorn/a
Meas. Tech.ChEMBL_598612 (CHEMBL1048115)
IC50 35±n/a nM
Citation Ren, JXLi, LLZou, JYang, LYang, JLYang, SY Pharmacophore modeling and virtual screening for the discovery of new transforming growth factor-beta type I receptor (ALK5) inhibitors. Eur J Med Chem44:4259-65 (2009) 
 
TGF-beta receptor type-1
Name:TGF-beta receptor type-1
Type:enzyme
Mol. Mass.:55968.24
Organism:Homo sapiens (Human)
Description:P36897
Residue:503
BDBM50184873
NameBDBM50184873
Synonyms:2-[4-cyanophenyl]-4-(3-pyridin-2-yl-1H-pyrazol-4-yl)pyridine CHEMBL437118
TypeSmall organic molecule
Emp. Form.C20H13N5
Mol. Mass.323.3507
SMILESN#Cc1ccc(cc1)-c1cc(ccn1)-c1c[nH]nc1-c1ccccn1