Reaction Details
TargetTGF-beta receptor type-1
LigandBDBM50301179
Substrate/Competitorn/a
Meas. Tech.ChEMBL_598612 (CHEMBL1048115)
IC50 59±n/a nM
Citation Ren, JXLi, LLZou, JYang, LYang, JLYang, SY Pharmacophore modeling and virtual screening for the discovery of new transforming growth factor-beta type I receptor (ALK5) inhibitors. Eur J Med Chem44:4259-65 (2009) 
 
TGF-beta receptor type-1
Name:TGF-beta receptor type-1
Type:enzyme
Mol. Mass.:55968.24
Organism:Homo sapiens (Human)
Description:P36897
Residue:503
BDBM50301179
NameBDBM50301179
Synonyms:4-(2-(pyridin-2-yl)-5,6-dihydro-4H-pyrrolo[1,2-b]pyrazol-3-yl)quinolin-7-amine | CHEMBL585700
TypeSmall organic molecule
Emp. Form.C20H17N5
Mol. Mass.327.3825
SMILESNc1ccc2c(ccnc2c1)-c1c2CCCn2nc1-c1ccccn1