Reaction Details
TargetTGF-beta receptor type-1
LigandBDBM50148656
Substrate/Competitorn/a
Meas. Tech.ChEMBL_598612 (CHEMBL1048115)
IC50 71±n/a nM
Citation Ren, JXLi, LLZou, JYang, LYang, JLYang, SY Pharmacophore modeling and virtual screening for the discovery of new transforming growth factor-beta type I receptor (ALK5) inhibitors. Eur J Med Chem44:4259-65 (2009) 
 
TGF-beta receptor type-1
Name:TGF-beta receptor type-1
Type:enzyme
Mol. Mass.:55968.24
Organism:Homo sapiens (Human)
Description:P36897
Residue:503
BDBM50148656
NameBDBM50148656
Synonyms:4-(2-(6-ethylpyridin-2-yl)-5,6-dihydro-4H-pyrrolo[1,2-b]pyrazol-3-yl)quinoline CHEMBL122583
TypeSmall organic molecule
Emp. Form.C22H20N4
Mol. Mass.340.421
SMILESCCc1cccc(n1)-c1nn2CCCc2c1-c1ccnc2ccccc12