Reaction Details
TargetCannabinoid receptor 2
LigandBDBM50301319
Substrate/Competitorn/a
Meas. Tech.ChEMBL_599309 (CHEMBL1041037)
EC50 110±n/a nM
Citation Worm, KWeaver, DGGreen, RCSaeui, CTDulay, DMBarker, WMCassel, JAStabley, GJDeHaven, RNLaBuda, CJKoblish, MBrogdon, BLSmith, SADolle, RE Discovery of N-(3-(morpholinomethyl)-phenyl)-amides as potent and selective CB2 agonists. Bioorg Med Chem Lett19:5004-8 (2009) 
 
Cannabinoid receptor 2
Name:Cannabinoid receptor 2
Type:G Protein-Coupled Receptor (GPCR)
Mol. Mass.:39690.94
Organism:Homo sapiens (Human)
Description:P34972
Residue:360
BDBM50301319
NameBDBM50301319
Synonyms:4-methyl-3-(3-morpholinopropyl)-N-((1S,4R)-1,3,3-trimethylbicyclo[2.2.1]heptan-2-yl)benzamide | CHEMBL583654
TypeSmall organic molecule
Emp. Form.C25H38N2O2
Mol. Mass.398.5814
SMILESCc1ccc(cc1CCCN1CCOCC1)C(=O)NC1[C@@]2(C)CC[C@H](C2)C1(C)C