Reaction Details
TargetCannabinoid receptor 1
LigandBDBM50301316
Substrate/Competitorn/a
Meas. Tech.ChEMBL_599307 (CHEMBL1041035)
Ki 540±n/a nM
Citation Worm, KWeaver, DGGreen, RCSaeui, CTDulay, DMBarker, WMCassel, JAStabley, GJDeHaven, RNLaBuda, CJKoblish, MBrogdon, BLSmith, SADolle, RE Discovery of N-(3-(morpholinomethyl)-phenyl)-amides as potent and selective CB2 agonists. Bioorg Med Chem Lett19:5004-8 (2009) 
 
Cannabinoid receptor 1
Name:Cannabinoid receptor 1
Type:G Protein-Coupled Receptor (GPCR)
Mol. Mass.:52868.96
Organism:Homo sapiens (Human)
Description:P21554
Residue:472
BDBM50301316
NameBDBM50301316
Synonyms:CHEMBL568468 | N-(3,4-dimethyl-5-(morpholinomethyl)phenyl)-2-methylcyclohexanecarboxamide
TypeSmall organic molecule
Emp. Form.C21H32N2O2
Mol. Mass.344.491
SMILESCC1CCCCC1C(=O)Nc1cc(C)c(C)c(CN2CCOCC2)c1