Reaction Details
TargetCannabinoid receptor 1
LigandBDBM50301739
Substrate/Competitorn/a
Meas. Tech.ChEMBL_597914 (CHEMBL1042699)
Ki 0.1±n/a nM
Citation Dow, RLHadcock, JRScott, DOSchneider, SRPaight, ESIredale, PACarpino, PAGriffith, DAHammond, MDasilva-Jardine, P Bioisosteric replacement of the hydrazide pharmacophore of the cannabinoid-1 receptor antagonist SR141716A. Part I: potent, orally-active 1,4-disubstituted imidazoles. Bioorg Med Chem Lett19:5351-4 (2009) 
 
Cannabinoid receptor 1
Name:Cannabinoid receptor 1
Type:G Protein-Coupled Receptor (GPCR)
Mol. Mass.:52868.96
Organism:Homo sapiens (Human)
Description:P21554
Residue:472
BDBM50301739
NameBDBM50301739
Synonyms:5-(4-chlorophenyl)-1-(2,4-dichlorophenyl)-4-methyl-3-(1-(2-phenylpropan-2-yl)-1H-imidazol-4-yl)-1H-pyrazole | CHEMBL584889
TypeSmall organic molecule
Emp. Form.C28H23Cl3N4
Mol. Mass.521.868
SMILESCc1c(nn(c1-c1ccc(Cl)cc1)-c1ccc(Cl)cc1Cl)-c1cn(cn1)C(C)(C)c1ccccc1