Reaction Details
TargetCannabinoid receptor 1
LigandBDBM50301743
Substrate/Competitorn/a
Meas. Tech.ChEMBL_597914 (CHEMBL1042699)
Ki 9±n/a nM
Citation Dow, RLHadcock, JRScott, DOSchneider, SRPaight, ESIredale, PACarpino, PAGriffith, DAHammond, MDasilva-Jardine, P Bioisosteric replacement of the hydrazide pharmacophore of the cannabinoid-1 receptor antagonist SR141716A. Part I: potent, orally-active 1,4-disubstituted imidazoles. Bioorg Med Chem Lett19:5351-4 (2009) 
 
Cannabinoid receptor 1
Name:Cannabinoid receptor 1
Type:G Protein-Coupled Receptor (GPCR)
Mol. Mass.:52868.96
Organism:Homo sapiens (Human)
Description:P21554
Residue:472
BDBM50301743
NameBDBM50301743
Synonyms:5-(4-chlorophenyl)-1-(2,4-dichlorophenyl)-3-(1-isopropyl-1H-imidazol-4-yl)-4-methyl-1H-pyrazole | CHEMBL578576
TypeSmall organic molecule
Emp. Form.C22H19Cl3N4
Mol. Mass.445.772
SMILESCC(C)n1cnc(c1)-c1nn(c(c1C)-c1ccc(Cl)cc1)-c1ccc(Cl)cc1Cl