Reaction Details
TargetCannabinoid receptor 1
LigandBDBM21278
Substrate/Competitorn/a
Meas. Tech.ChEMBL_597913 (CHEMBL1042698)
Ki 0.9±n/a nM
Citation Dow, RLHadcock, JRScott, DOSchneider, SRPaight, ESIredale, PACarpino, PAGriffith, DAHammond, MDasilva-Jardine, P Bioisosteric replacement of the hydrazide pharmacophore of the cannabinoid-1 receptor antagonist SR141716A. Part I: potent, orally-active 1,4-disubstituted imidazoles. Bioorg Med Chem Lett19:5351-4 (2009) 
 
Cannabinoid receptor 1
Name:Cannabinoid receptor 1
Type:G Protein-Coupled Receptor (GPCR)
Mol. Mass.:52856.55
Organism:Rattus norvegicus (rat)
Description:P20272
Residue:473
BDBM21278
NameBDBM21278
Synonyms:5-(4-chlorophenyl)-1-(2,4-dichlorophenyl)-4-methyl-N-(piperidin-1-yl)-1H-pyrazole-3-carboxamide CHEMBL111 RIMONABANT HYDROCHLORIDE SR 141716A SR141716A [3H]SR141716A
TypeSmall organic molecule
Emp. Form.C22H21Cl3N4O
Mol. Mass.463.787
SMILESCc1c(nn(c1-c1ccc(Cl)cc1)-c1ccc(Cl)cc1Cl)C(=O)NN1CCCCC1