Reaction Details
TargetCytochrome P450 2C9
LigandBDBM50301735
Substrate/Competitorn/a
Meas. Tech.ChEMBL_598027 (CHEMBL1046296)
IC50>10000±n/a nM
Citation Dow, RLHadcock, JRScott, DOSchneider, SRPaight, ESIredale, PACarpino, PAGriffith, DAHammond, MDasilva-Jardine, P Bioisosteric replacement of the hydrazide pharmacophore of the cannabinoid-1 receptor antagonist SR141716A. Part I: potent, orally-active 1,4-disubstituted imidazoles. Bioorg Med Chem Lett19:5351-4 (2009) 
 
Cytochrome P450 2C9
Name:Cytochrome P450 2C9
Type:Enzyme
Mol. Mass.:55636.33
Organism:Homo sapiens (Human)
Description:P11712
Residue:490
BDBM50301735
NameBDBM50301735
Synonyms:1-(2-chlorophenyl)-5-(4-chlorophenyl)-3-(1-isopropyl-1H-imidazol-4-yl)-4-methyl-1H-pyrazole | CHEMBL584261
TypeSmall organic molecule
Emp. Form.C22H20Cl2N4
Mol. Mass.411.327
SMILESCC(C)n1cnc(c1)-c1nn(c(c1C)-c1ccc(Cl)cc1)-c1ccccc1Cl