Reaction Details
TargetCannabinoid receptor 1
LigandBDBM50301750
Substrate/Competitorn/a
Meas. Tech.ChEMBL_597913 (CHEMBL1042698)
Ki 31±n/a nM
Citation Dow, RLHadcock, JRScott, DOSchneider, SRPaight, ESIredale, PACarpino, PAGriffith, DAHammond, MDasilva-Jardine, P Bioisosteric replacement of the hydrazide pharmacophore of the cannabinoid-1 receptor antagonist SR141716A. Part I: potent, orally-active 1,4-disubstituted imidazoles. Bioorg Med Chem Lett19:5351-4 (2009) 
 
Cannabinoid receptor 1
Name:Cannabinoid receptor 1
Type:G Protein-Coupled Receptor (GPCR)
Mol. Mass.:52856.55
Organism:Rattus norvegicus (rat)
Description:P20272
Residue:473
BDBM50301750
NameBDBM50301750
Synonyms:1-(2-chlorophenyl)-5-(4-chlorophenyl)-3-(5-isopropyl-1H-imidazol-4-yl)-4-methyl-1H-pyrazole | CHEMBL568229
TypeSmall organic molecule
Emp. Form.C22H20Cl2N4
Mol. Mass.411.327
SMILESCC(C)c1[nH]cnc1-c1nn(c(c1C)-c1ccc(Cl)cc1)-c1ccccc1Cl