Reaction Details
TargetAcetyl-CoA carboxylase 1
LigandBDBM50302339
Substrate/Competitorn/a
Meas. Tech.ChEMBL_596937 (CHEMBL1048878)
IC50 14±n/a nM
Citation Haque, TSLiang, NGolla, RSeethala, RMa, ZEwing, WRCooper, CBPelleymounter, MAPoss, MACheng, D Potent biphenyl- and 3-phenyl pyridine-based inhibitors of acetyl-CoA carboxylase. Bioorg Med Chem Lett19:5872-6 (2009) 
 
Acetyl-CoA carboxylase 1
Name:Acetyl-CoA carboxylase 1
Type:Protein
Mol. Mass.:265543.22
Organism:Homo sapiens (Human)
Description:Q13085
Residue:2346
BDBM50302339
NameBDBM50302339
Synonyms:CHEMBL567281 | N-(1-(4'-(4-phenoxyphenoxy)biphenyl-4-yl)ethyl)acetamide
TypeSmall organic molecule
Emp. Form.C28H25NO3
Mol. Mass.423.503
SMILESCC(NC(C)=O)c1ccc(cc1)-c1ccc(Oc2ccc(Oc3ccccc3)cc2)cc1