Reaction Details
TargetCannabinoid receptor 1
LigandBDBM50302374
Substrate/Competitorn/a
Meas. Tech.ChEMBL_597135 (CHEMBL1048890)
EC50>30000±n/a nM
Citation Giblin, GMBillinton, ABriggs, MBrown, AJChessell, IPClayton, NMEatherton, AJGoldsmith, PHaslam, CJohnson, MRMitchell, WLNaylor, APerboni, ASlingsby, BPWilson, AW Discovery of 1-[4-(3-chlorophenylamino)-1-methyl-1H-pyrrolo[3,2-c]pyridin-7-yl]-1-morpholin-4-ylmethanone (GSK554418A), a brain penetrant 5-azaindole CB2 agonist for the treatment of chronic pain. J Med Chem52:5785-8 (2009) 
 
Cannabinoid receptor 1
Name:Cannabinoid receptor 1
Type:G Protein-Coupled Receptor (GPCR)
Mol. Mass.:52868.96
Organism:Homo sapiens (Human)
Description:P21554
Residue:472
BDBM50302374
NameBDBM50302374
Synonyms:7-(3-Chloro-phenylamino)-3-methyl-1H-pyrrolo[2,3-c]pyridine-4-carboxylic acid(tetrahydro-pyran-4-yl)-amide | CHEMBL585888
TypeSmall organic molecule
Emp. Form.C20H21ClN4O2
Mol. Mass.384.859
SMILESCc1c[nH]c2c(Nc3cccc(Cl)c3)ncc(C(=O)NC3CCOCC3)c12