Reaction Details
TargetCannabinoid receptor 1
LigandBDBM50302383
Substrate/Competitorn/a
Meas. Tech.ChEMBL_597135 (CHEMBL1048890)
EC50>10000±n/a nM
Citation Giblin, GMBillinton, ABriggs, MBrown, AJChessell, IPClayton, NMEatherton, AJGoldsmith, PHaslam, CJohnson, MRMitchell, WLNaylor, APerboni, ASlingsby, BPWilson, AW Discovery of 1-[4-(3-chlorophenylamino)-1-methyl-1H-pyrrolo[3,2-c]pyridin-7-yl]-1-morpholin-4-ylmethanone (GSK554418A), a brain penetrant 5-azaindole CB2 agonist for the treatment of chronic pain. J Med Chem52:5785-8 (2009) 
 
Cannabinoid receptor 1
Name:Cannabinoid receptor 1
Type:G Protein-Coupled Receptor (GPCR)
Mol. Mass.:52868.96
Organism:Homo sapiens (Human)
Description:P21554
Residue:472
BDBM50302383
NameBDBM50302383
Synonyms:1-[7-(2-Methoxy-phenylamino)-3-methyl-1H-pyrrolo[2,3-c]pyridin-4-yl]-1-morpholin-4-yl-methanone | CHEMBL566466
TypeSmall organic molecule
Emp. Form.C20H22N4O3
Mol. Mass.366.4137
SMILESCOc1ccccc1Nc1ncc(C(=O)N2CCOCC2)c2c(C)c[nH]c12