Reaction Details
TargetCannabinoid receptor 1
LigandBDBM50302384
Substrate/Competitorn/a
Meas. Tech.ChEMBL_597135 (CHEMBL1048890)
EC50 25100±n/a nM
Citation Giblin, GMBillinton, ABriggs, MBrown, AJChessell, IPClayton, NMEatherton, AJGoldsmith, PHaslam, CJohnson, MRMitchell, WLNaylor, APerboni, ASlingsby, BPWilson, AW Discovery of 1-[4-(3-chlorophenylamino)-1-methyl-1H-pyrrolo[3,2-c]pyridin-7-yl]-1-morpholin-4-ylmethanone (GSK554418A), a brain penetrant 5-azaindole CB2 agonist for the treatment of chronic pain. J Med Chem52:5785-8 (2009) 
 
Cannabinoid receptor 1
Name:Cannabinoid receptor 1
Type:G Protein-Coupled Receptor (GPCR)
Mol. Mass.:52868.96
Organism:Homo sapiens (Human)
Description:P21554
Residue:472
BDBM50302384
NameBDBM50302384
Synonyms:1-[7-(3-Methoxy-phenylamino)-3-methyl-1H-pyrrolo[2,3-c]pyridin-4-yl]-1-morpholin-4-yl-methanone | CHEMBL566238
TypeSmall organic molecule
Emp. Form.C20H22N4O3
Mol. Mass.366.4137
SMILESCOc1cccc(Nc2ncc(C(=O)N3CCOCC3)c3c(C)c[nH]c23)c1