Reaction Details
TargetCannabinoid receptor 1
LigandBDBM50302372
Substrate/Competitorn/a
Meas. Tech.ChEMBL_597135 (CHEMBL1048890)
EC50 6300±n/a nM
Citation Giblin, GMBillinton, ABriggs, MBrown, AJChessell, IPClayton, NMEatherton, AJGoldsmith, PHaslam, CJohnson, MRMitchell, WLNaylor, APerboni, ASlingsby, BPWilson, AW Discovery of 1-[4-(3-chlorophenylamino)-1-methyl-1H-pyrrolo[3,2-c]pyridin-7-yl]-1-morpholin-4-ylmethanone (GSK554418A), a brain penetrant 5-azaindole CB2 agonist for the treatment of chronic pain. J Med Chem52:5785-8 (2009) 
 
Cannabinoid receptor 1
Name:Cannabinoid receptor 1
Type:G Protein-Coupled Receptor (GPCR)
Mol. Mass.:52868.96
Organism:Homo sapiens (Human)
Description:P21554
Residue:472
BDBM50302372
NameBDBM50302372
Synonyms:(4-(3-chlorophenylamino)-1-methyl-1H-pyrrolo[3,2-c]pyridin-7-yl)(morpholino)methanone GSK-554418A
TypeSmall organic molecule
Emp. Form.C19H19ClN4O2
Mol. Mass.370.833
SMILESCn1ccc2c(Nc3cccc(Cl)c3)ncc(C(=O)N3CCOCC3)c12