Reaction Details
TargetAngiotensin-converting enzyme
LigandBDBM50303322
Substrate/Competitorn/a
Meas. Tech.ChEMBL_595724 (CHEMBL1045247)
Ki 1.4±n/a nM
Citation Jullien, NMakritis, AGeorgiadis, DBeau, FYiotakis, ADive, V Phosphinic tripeptides as dual angiotensin-converting enzyme C-domain and endothelin-converting enzyme-1 inhibitors. J Med Chem53:208-20 (2010) 
 
Angiotensin-converting enzyme
Name:Angiotensin-converting enzyme
Type:Enzyme
Mol. Mass.:149709.01
Organism:Homo sapiens (Human)
Description:n/a
Residue:1306
BDBM50303322
NameBDBM50303322
Synonyms:(2S)-2-({3-[Hydroxyl(2-phenyl-(1R)-1-{[(benzyloxy)carbonyl]-amino}ethyl)phosphinyl]-(2S)-2-[(3-phenylisoxazol-5-yl)methyl]-1-oxopropyl}amino)1H-Indole-3-propanoic Acid | CHEMBL577753
TypeSmall organic molecule
Emp. Form.C40H39N4O8P
Mol. Mass.734.7334
SMILESOC(=O)[C@H](Cc1c[nH]c2ccccc12)NC(=O)[C@H](Cc1cc(no1)-c1ccccc1)CP(O)(=O)[C@H](Cc1ccccc1)NC(=O)OCc1ccccc1