Reaction Details
TargetAngiotensin-converting enzyme
LigandBDBM50303320
Substrate/Competitorn/a
Meas. Tech.ChEMBL_595733 (CHEMBL1045256)
Ki 0.68±n/a nM
Citation Jullien, NMakritis, AGeorgiadis, DBeau, FYiotakis, ADive, V Phosphinic tripeptides as dual angiotensin-converting enzyme C-domain and endothelin-converting enzyme-1 inhibitors. J Med Chem53:208-20 (2010) 
 
Angiotensin-converting enzyme
Name:Angiotensin-converting enzyme
Type:Enzyme
Mol. Mass.:149709.01
Organism:Homo sapiens (Human)
Description:n/a
Residue:1306
BDBM50303320
NameBDBM50303320
Synonyms:(S)-2-[(R)-3-[((R)-1-Benzyloxycarbonylamino-2-phenyl-ethyl)-hydroxy-phosphinoyl]-2-(3-phenyl-isoxazol-5-ylmethyl)-propionylamino]-3-(4-hydroxy-phenyl)-propionic acid | CHEMBL570953
TypeSmall organic molecule
Emp. Form.C38H38N3O9P
Mol. Mass.711.6968
SMILESOC(=O)[C@H](Cc1ccc(O)cc1)NC(=O)[C@@H](Cc1cc(no1)-c1ccccc1)CP(O)(=O)[C@H](Cc1ccccc1)NC(=O)OCc1ccccc1