Reaction Details
TargetAngiotensin-converting enzyme
LigandBDBM50303327
Substrate/Competitorn/a
Meas. Tech.ChEMBL_595724 (CHEMBL1045247)
Ki 3±n/a nM
Citation Jullien, NMakritis, AGeorgiadis, DBeau, FYiotakis, ADive, V Phosphinic tripeptides as dual angiotensin-converting enzyme C-domain and endothelin-converting enzyme-1 inhibitors. J Med Chem53:208-20 (2010) 
 
Angiotensin-converting enzyme
Name:Angiotensin-converting enzyme
Type:Enzyme
Mol. Mass.:149709.01
Organism:Homo sapiens (Human)
Description:n/a
Residue:1306
BDBM50303327
NameBDBM50303327
Synonyms:(2S)-2-((1S,2S)-2-(((R)-1-(benzyloxycarbonylamino)-2-phenylethyl)(hydroxy)phosphoryl)cyclopentanecarboxamido)-3-(1H-indol-3-yl)propanoic acid | CHEMBL571716
TypeSmall organic molecule
Emp. Form.C33H36N3O7P
Mol. Mass.617.6286
SMILESOC(=O)[C@H](Cc1c[nH]c2ccccc12)NC(=O)C1=C(CCC1)P(O)(O)[C@H](Cc1ccccc1)NC(=O)OCc1ccccc1