Reaction Details
TargetNeprilysin
LigandBDBM50303322
Substrate/Competitorn/a
Meas. Tech.ChEMBL_595725 (CHEMBL1045248)
Ki 130±n/a nM
Citation Jullien, NMakritis, AGeorgiadis, DBeau, FYiotakis, ADive, V Phosphinic tripeptides as dual angiotensin-converting enzyme C-domain and endothelin-converting enzyme-1 inhibitors. J Med Chem53:208-20 (2010) 
 
Neprilysin
Name:Neprilysin
Type:Enzyme
Mol. Mass.:85505.38
Organism:Homo sapiens (Human)
Description:P08473
Residue:750
BDBM50303322
NameBDBM50303322
Synonyms:(2S)-2-({3-[Hydroxyl(2-phenyl-(1R)-1-{[(benzyloxy)carbonyl]-amino}ethyl)phosphinyl]-(2S)-2-[(3-phenylisoxazol-5-yl)methyl]-1-oxopropyl}amino)1H-Indole-3-propanoic Acid | CHEMBL577753
TypeSmall organic molecule
Emp. Form.C40H39N4O8P
Mol. Mass.734.7334
SMILESOC(=O)[C@H](Cc1c[nH]c2ccccc12)NC(=O)[C@H](Cc1cc(no1)-c1ccccc1)CP(O)(=O)[C@H](Cc1ccccc1)NC(=O)OCc1ccccc1