Reaction Details
TargetNeutrophil elastase
LigandBDBM50235613
Substrate/Competitorn/a
Meas. Tech.ChEMBL_595760 (CHEMBL1045283)
Ki 1.21±n/a nM
Citation Mulchande, JOliveira, RCarrasco, MGouveia, LGuedes, RCIley, JMoreira, R 4-Oxo-beta-lactams (azetidine-2,4-diones) are potent and selective inhibitors of human leukocyte elastase. J Med Chem53:241-53 (2010) 
 
Neutrophil elastase
Name:Neutrophil elastase
Type:Enzyme
Mol. Mass.:28532.38
Organism:Homo sapiens (Human)
Description:P08246
Residue:267
BDBM50235613
NameBDBM50235613
Synonyms:3,3-diethyl-1-phenylazetidine-2,4-dione | CHEMBL272413
TypeSmall organic molecule
Emp. Form.C13H15NO2
Mol. Mass.217.2637
SMILESCCC1(CC)C(=O)N(C1=O)c1ccccc1