Reaction Details
TargetNeutrophil elastase
LigandBDBM50303357
Substrate/Competitorn/a
Meas. Tech.ChEMBL_595760 (CHEMBL1045283)
Ki 1.3±n/a nM
Citation Mulchande, JOliveira, RCarrasco, MGouveia, LGuedes, RCIley, JMoreira, R 4-Oxo-beta-lactams (azetidine-2,4-diones) are potent and selective inhibitors of human leukocyte elastase. J Med Chem53:241-53 (2010) 
 
Neutrophil elastase
Name:Neutrophil elastase
Type:Enzyme
Mol. Mass.:28532.38
Organism:Homo sapiens (Human)
Description:P08246
Residue:267
BDBM50303357
NameBDBM50303357
Synonyms:3,3-Diethyl-1-(6-methylpyridin-3-yl)azetidine-2,4-dione | CHEMBL566919
TypeSmall organic molecule
Emp. Form.C13H16N2O2
Mol. Mass.232.2783
SMILESCCC1(CC)C(=O)N(C1=O)c1ccc(C)nc1