Reaction Details
TargetProteinase K
LigandBDBM50303420
Substrate/Competitorn/a
Meas. Tech.ChEMBL_595928 (CHEMBL1041782)
IC50 74131.02±n/a nM
Citation Mott, BTFerreira, RSSimeonov, AJadhav, AAng, KKLeister, WShen, MSilveira, JTDoyle, PSArkin, MRMcKerrow, JHInglese, JAustin, CPThomas, CJShoichet, BKMaloney, DJ Identification and optimization of inhibitors of Trypanosomal cysteine proteases: cruzain, rhodesain, and TbCatB. J Med Chem53:52-60 (2010) 
 
Proteinase K
Name:Proteinase K
Type:PROTEIN
Mol. Mass.:40301.60
Organism:Engyodontium album
Description:ChEMBL_595928
Residue:384
BDBM50303420
NameBDBM50303420
Synonyms:6-(3,5-Difluorophenylamino)-9-ethyl-9H-purine-2-carbonitrile CHEMBL567341
TypeSmall organic molecule
Emp. Form.C14H10F2N6
Mol. Mass.300.2662
SMILESCCn1cnc2c(Nc3cc(F)cc(F)c3)nc(nc12)C#N