Reaction Details
TargetCannabinoid receptor 2
LigandBDBM50303543
Substrate/Competitorn/a
Meas. Tech.ChEMBL_596087 (CHEMBL1040875)
Ki 20±n/a nM
Citation Frost, JMDart, MJTietje, KRGarrison, TRGrayson, GKDaza, AVEl-Kouhen, OFYao, BBHsieh, GCPai, MZhu, CZChandran, PMeyer, MD Indol-3-ylcycloalkyl ketones: effects of N1 substituted indole side chain variations on CB(2) cannabinoid receptor activity. J Med Chem53:295-315 (2010) 
 
Cannabinoid receptor 2
Name:Cannabinoid receptor 2
Type:G Protein-Coupled Receptor (GPCR)
Mol. Mass.:39690.94
Organism:Homo sapiens (Human)
Description:P34972
Residue:360
BDBM50303543
NameBDBM50303543
Synonyms:(1-(2-(Pyridin-3-yl)ethyl)-1H-indol-3-yl)(2,2,3,3-tetramethylcyclopropyl)methanone | CHEMBL578179
TypeSmall organic molecule
Emp. Form.C23H26N2O
Mol. Mass.346.4653
SMILESCC1(C)C(C(=O)c2cn(CCc3cccnc3)c3ccccc23)C1(C)C