Reaction Details
TargetCannabinoid receptor 2
LigandBDBM50303524
Substrate/Competitorn/a
Meas. Tech.ChEMBL_596087 (CHEMBL1040875)
Ki 9.2±n/a nM
Citation Frost, JMDart, MJTietje, KRGarrison, TRGrayson, GKDaza, AVEl-Kouhen, OFYao, BBHsieh, GCPai, MZhu, CZChandran, PMeyer, MD Indol-3-ylcycloalkyl ketones: effects of N1 substituted indole side chain variations on CB(2) cannabinoid receptor activity. J Med Chem53:295-315 (2010) 
 
Cannabinoid receptor 2
Name:Cannabinoid receptor 2
Type:G Protein-Coupled Receptor (GPCR)
Mol. Mass.:39690.94
Organism:Homo sapiens (Human)
Description:P34972
Residue:360
BDBM50303524
NameBDBM50303524
Synonyms:(1-Propyl-1H-indol-3-yl)(2,2,3,3-tetramethylcyclopropyl)methanone | CHEMBL579241
TypeSmall organic molecule
Emp. Form.C19H25NO
Mol. Mass.283.4079
SMILESCCCn1cc(C(=O)C2C(C)(C)C2(C)C)c2ccccc12