Reaction Details
TargetCannabinoid receptor 1
LigandBDBM21311
Substrate/Competitorn/a
Meas. Tech.ChEMBL_596092 (CHEMBL1040880)
EC50 811±n/a nM
Citation Frost, JMDart, MJTietje, KRGarrison, TRGrayson, GKDaza, AVEl-Kouhen, OFYao, BBHsieh, GCPai, MZhu, CZChandran, PMeyer, MD Indol-3-ylcycloalkyl ketones: effects of N1 substituted indole side chain variations on CB(2) cannabinoid receptor activity. J Med Chem53:295-315 (2010) 
 
Cannabinoid receptor 1
Name:Cannabinoid receptor 1
Type:G Protein-Coupled Receptor (GPCR)
Mol. Mass.:52868.96
Organism:Homo sapiens (Human)
Description:P21554
Residue:472
BDBM21311
NameBDBM21311
Synonyms:4-(2-{3-[(2,2,3,3-tetramethylcyclopropyl)carbonyl]-1H-indol-1-yl}ethyl)morpholine Morpholino-ethyl analogue, 32
TypeSmall organic molecule
Emp. Form.C22H30N2O2
Mol. Mass.354.4858
SMILESCC1(C)C(C(=O)c2cn(CCN3CCOCC3)c3ccccc23)C1(C)C