Reaction Details
TargetCannabinoid receptor 2
LigandBDBM50303530
Substrate/Competitorn/a
Meas. Tech.ChEMBL_596098 (CHEMBL1040886)
EC50 4.4±n/a nM
Citation Frost, JMDart, MJTietje, KRGarrison, TRGrayson, GKDaza, AVEl-Kouhen, OFYao, BBHsieh, GCPai, MZhu, CZChandran, PMeyer, MD Indol-3-ylcycloalkyl ketones: effects of N1 substituted indole side chain variations on CB(2) cannabinoid receptor activity. J Med Chem53:295-315 (2010) 
 
Cannabinoid receptor 2
Name:Cannabinoid receptor 2
Type:Enzyme
Mol. Mass.:39366.68
Organism:Rattus norvegicus (Rat)
Description:Q9QZN9
Residue:360
BDBM50303530
NameBDBM50303530
Synonyms:(1-(4-Hydroxybutyl)-1H-indol-3-yl)(2,2,3,3-tetramethylcyclopropyl)methanone | CHEMBL576706
TypeSmall organic molecule
Emp. Form.C20H27NO2
Mol. Mass.313.4339
SMILESCC1(C)C(C(=O)c2cn(CCCCO)c3ccccc23)C1(C)C