Reaction Details
TargetCannabinoid receptor 2
LigandBDBM21282
Substrate/Competitorn/a
Meas. Tech.ChEMBL_596087 (CHEMBL1040875)
Ki 35±n/a nM
Citation Frost, JMDart, MJTietje, KRGarrison, TRGrayson, GKDaza, AVEl-Kouhen, OFYao, BBHsieh, GCPai, MZhu, CZChandran, PMeyer, MD Indol-3-ylcycloalkyl ketones: effects of N1 substituted indole side chain variations on CB(2) cannabinoid receptor activity. J Med Chem53:295-315 (2010) 
 
Cannabinoid receptor 2
Name:Cannabinoid receptor 2
Type:G Protein-Coupled Receptor (GPCR)
Mol. Mass.:39690.94
Organism:Homo sapiens (Human)
Description:P34972
Residue:360
BDBM21282
NameBDBM21282
Synonyms:2-methyl-3-(naphthalen-1-ylcarbonyl)-1-propyl-1H-indole JWH-015
Typen/a
Emp. Form.C23H21NO
Mol. Mass.327.4189
SMILESCCCn1c(C)c(C(=O)c2cccc3ccccc23)c2ccccc12