Reaction Details
TargetCannabinoid receptor 2
LigandBDBM50303575
Substrate/Competitorn/a
Meas. Tech.ChEMBL_596090 (CHEMBL1040878)
EC50 20±n/a nM
Citation Frost, JMDart, MJTietje, KRGarrison, TRGrayson, GKDaza, AVEl-Kouhen, OFYao, BBHsieh, GCPai, MZhu, CZChandran, PMeyer, MD Indol-3-ylcycloalkyl ketones: effects of N1 substituted indole side chain variations on CB(2) cannabinoid receptor activity. J Med Chem53:295-315 (2010) 
 
Cannabinoid receptor 2
Name:Cannabinoid receptor 2
Type:G Protein-Coupled Receptor (GPCR)
Mol. Mass.:39690.94
Organism:Homo sapiens (Human)
Description:P34972
Residue:360
BDBM50303575
NameBDBM50303575
Synonyms:CHEMBL570907 | Cyclopentyl(1-((tetrahydro-2H-pyran-4-yl)methyl)-1H-indol-3-yl)methanone
TypeSmall organic molecule
Emp. Form.C20H25NO2
Mol. Mass.311.418
SMILESO=C(C1CCCC1)c1cn(CC2CCOCC2)c2ccccc12