Reaction Details
TargetCannabinoid receptor 2
LigandBDBM50303558
Substrate/Competitorn/a
Meas. Tech.ChEMBL_596087 (CHEMBL1040875)
Ki 0.48±n/a nM
Citation Frost, JMDart, MJTietje, KRGarrison, TRGrayson, GKDaza, AVEl-Kouhen, OFYao, BBHsieh, GCPai, MZhu, CZChandran, PMeyer, MD Indol-3-ylcycloalkyl ketones: effects of N1 substituted indole side chain variations on CB(2) cannabinoid receptor activity. J Med Chem53:295-315 (2010) 
 
Cannabinoid receptor 2
Name:Cannabinoid receptor 2
Type:G Protein-Coupled Receptor (GPCR)
Mol. Mass.:39690.94
Organism:Homo sapiens (Human)
Description:P34972
Residue:360
BDBM50303558
NameBDBM50303558
Synonyms:(1-((1-Methylpiperidin-2-yl)methyl)-1H-indol-3-yl)(2,2,3,3-tetramethylcyclopropyl)methanone | CHEMBL571330
TypeSmall organic molecule
Emp. Form.C23H32N2O
Mol. Mass.352.513
SMILESCN1CCCCC1Cn1cc(C(=O)C2C(C)(C)C2(C)C)c2ccccc12