Reaction Details
TargetCannabinoid receptor 2
LigandBDBM50303566
Substrate/Competitorn/a
Meas. Tech.ChEMBL_596087 (CHEMBL1040875)
Ki 2.2±n/a nM
Citation Frost, JMDart, MJTietje, KRGarrison, TRGrayson, GKDaza, AVEl-Kouhen, OFYao, BBHsieh, GCPai, MZhu, CZChandran, PMeyer, MD Indol-3-ylcycloalkyl ketones: effects of N1 substituted indole side chain variations on CB(2) cannabinoid receptor activity. J Med Chem53:295-315 (2010) 
 
Cannabinoid receptor 2
Name:Cannabinoid receptor 2
Type:G Protein-Coupled Receptor (GPCR)
Mol. Mass.:39690.94
Organism:Homo sapiens (Human)
Description:P34972
Residue:360
BDBM50303566
NameBDBM50303566
Synonyms:(1-(2-(Piperidin-1-yl)ethyl)-1H-indol-3-yl)(2,2,3,3-tetramethylcyclopropyl)methanone | CHEMBL570876
TypeSmall organic molecule
Emp. Form.C23H32N2O
Mol. Mass.352.513
SMILESCC1(C)C(C(=O)c2cn(CCN3CCCCC3)c3ccccc23)C1(C)C