Reaction Details
TargetLeukotriene A-4 hydrolase
LigandBDBM50303657
Substrate/Competitorn/a
Meas. Tech.ChEMBL_596628 (CHEMBL1046155)
IC50 23±n/a nM
Citation Sandanayaka, VMamat, BMishra, RKWinger, JKrohn, MZhou, LMKeyvan, MEnache, LSullins, DOnua, EZhang, JHalldorsdottir, GSigthorsdottir, HThorlaksdottir, ASigthorsson, GThorsteinnsdottir, MDavies, DRStewart, LJZembower, DEAndresson, TKiselyov, ASSingh, JGurney, ME Discovery of 4-[(2S)-2-{[4-(4-chlorophenoxy)phenoxy]methyl}-1-pyrrolidinyl]butanoic acid (DG-051) as a novel leukotriene A4 hydrolase inhibitor of leukotriene B4 biosynthesis. J Med Chem53:573-85 (2010) 
 
Leukotriene A-4 hydrolase
Name:Leukotriene A-4 hydrolase
Type:Hydrolase; metalloprotease
Mol. Mass.:69280.41
Organism:Homo sapiens (Human)
Description:Human recombinant LTA4H.
Residue:611
BDBM50303657
NameBDBM50303657
Synonyms:3-{(R)-2-[4-(4-Chlorophenoxy)phenoxymethyl]pyrrolidin-1-yl}-propionic Acid | CHEMBL565605
TypeSmall organic molecule
Emp. Form.C20H22ClNO4
Mol. Mass.375.846
SMILESOC(=O)CCN1CCC[C@@H]1COc1ccc(Oc2ccc(Cl)cc2)cc1