Reaction Details
TargetProstaglandin E2 receptor EP3 subtype
LigandBDBM50303664
Substrate/Competitorn/a
Meas. Tech.ChEMBL_596837 (CHEMBL1042648)
IC50 6.6±n/a nM
Citation Singh, JZeller, WZhou, NHategan, GMishra, RKPolozov, AYu, POnua, EZhang, JRamírez, JLSigthorsson, GThorsteinnsdottir, MKiselyov, ASZembower, DEAndrésson, TGurney, ME Structure-activity relationship studies leading to the identification of (2E)-3-[l-[(2,4-dichlorophenyl)methyl]-5-fluoro-3-methyl-lH-indol-7-yl]-N-[(4,5-dichloro-2-thienyl)sulfonyl]-2-propenamide (DG-041), a potent and selective prostanoid EP3 receptor antagonist, as a novel antiplatelet agent that J Med Chem53:18-36 (2010) 
 
Prostaglandin E2 receptor EP3 subtype
Name:Prostaglandin E2 receptor EP3 subtype
Type:Enzyme
Mol. Mass.:43335.03
Organism:Homo sapiens (Human)
Description:P43115
Residue:390
BDBM50303664
NameBDBM50303664
Synonyms:4,5-Dichlorothiophene-2-sulfonic Acid{(E)-3-[1-(4-Cyanobenzyl)-5-fluoro-3-methyl-1H-indol-7-yl]acryloyl}amide | CHEMBL584488
TypeSmall organic molecule
Emp. Form.C24H16Cl2FN3O3S2
Mol. Mass.548.437
SMILESCc1cn(Cc2ccc(cc2)C#N)c2c(\C=C\C(=O)NS(=O)(=O)c3cc(Cl)c(Cl)s3)cc(F)cc12