Reaction Details
TargetProstaglandin E2 receptor EP3 subtype
LigandBDBM50303677
Substrate/Competitorn/a
Meas. Tech.ChEMBL_596837 (CHEMBL1042648)
IC50 2.2±n/a nM
Citation Singh, JZeller, WZhou, NHategan, GMishra, RKPolozov, AYu, POnua, EZhang, JRamírez, JLSigthorsson, GThorsteinnsdottir, MKiselyov, ASZembower, DEAndrésson, TGurney, ME Structure-activity relationship studies leading to the identification of (2E)-3-[l-[(2,4-dichlorophenyl)methyl]-5-fluoro-3-methyl-lH-indol-7-yl]-N-[(4,5-dichloro-2-thienyl)sulfonyl]-2-propenamide (DG-041), a potent and selective prostanoid EP3 receptor antagonist, as a novel antiplatelet agent that J Med Chem53:18-36 (2010) 
 
Prostaglandin E2 receptor EP3 subtype
Name:Prostaglandin E2 receptor EP3 subtype
Type:Enzyme
Mol. Mass.:43335.03
Organism:Homo sapiens (Human)
Description:P43115
Residue:390
BDBM50303677
NameBDBM50303677
Synonyms:CHEMBL566016 | N-(4,5-dichlorothiophen-2-ylsulfonyl)-3-(5-fluoro-3-methyl-7-(naphthalen-2-yloxy)-1H-indol-1-yl)propanamide
TypeSmall organic molecule
Emp. Form.C26H19Cl2FN2O4S2
Mol. Mass.577.474
SMILESCc1cn(CCC(=O)NS(=O)(=O)c2cc(Cl)c(Cl)s2)c2c(Oc3ccc4ccccc4c3)cc(F)cc12