Reaction Details
TargetProprotein convertase subtilisin/kexin type 5
LigandBDBM50303777
Substrate/Competitorn/a
Meas. Tech.ChEMBL_597565 (CHEMBL1049702)
Ki 85±n/a nM
Citation Becker, GLSielaff, FThan, MELindberg, IRouthier, SDay, RLu, YGarten, WSteinmetzer, T Potent inhibitors of furin and furin-like proprotein convertases containing decarboxylated P1 arginine mimetics. J Med Chem53:1067-75 (2010) 
 
Proprotein convertase subtilisin/kexin type 5
Name:Proprotein convertase subtilisin/kexin type 5
Type:PROTEIN
Mol. Mass.:206919.79
Organism:Homo sapiens (Human)
Description:ChEMBL_597565
Residue:1860
BDBM50303777
NameBDBM50303777
Synonyms:(S)-5-guanidino-N-((S)-1-((S)-5-guanidino-1-(3-guanidinopropylamino)-1-oxopentan-2-ylamino)-3-methyl-1-oxobutan-2-yl)-2-(2-phenylacetamido)pentanamide | CHEMBL569280
TypeSmall organic molecule
Emp. Form.C30H53N13O4
Mol. Mass.659.8265
SMILES[#6]-[#6](-[#6])-[#6@H](-[#7]-[#6](=O)-[#6@H](-[#6]-[#6]-[#6]\[#7]=[#6](/[#7])-[#7])-[#7]-[#6](=O)-[#6]-c1ccccc1)-[#6](=O)-[#7]-[#6@@H](-[#6]-[#6]-[#6]\[#7]=[#6](/[#7])-[#7])-[#6](=O)-[#7]-[#6]-[#6]-[#6]-[#6]\[#7]=[#6](\[#7])-[#7]