Reaction Details
TargetFurin
LigandBDBM50303781
Substrate/Competitorn/a
Meas. Tech.ChEMBL_597562 (CHEMBL1049699)
Ki 3.3±n/a nM
Citation Becker, GLSielaff, FThan, MELindberg, IRouthier, SDay, RLu, YGarten, WSteinmetzer, T Potent inhibitors of furin and furin-like proprotein convertases containing decarboxylated P1 arginine mimetics. J Med Chem53:1067-75 (2010) 
 
Furin
Name:Furin
Type:Enzyme Catalytic Domain
Mol. Mass.:86676.01
Organism:Homo sapiens (Human)
Description:P09958
Residue:794
BDBM50303781
NameBDBM50303781
Synonyms:CHEMBL565931 | N-((4S,7S,10S)-15-amino-4-(4-aminobutyl)-1-(4-carbamimidoylphenyl)-15-imino-7-isopropyl-3,6,9-trioxo-2,5,8,14-tetraazapentadecan-10-yl)decanamide
TypeSmall organic molecule
Emp. Form.C35H62N10O4
Mol. Mass.686.9314
SMILES[#6]-[#6]-[#6]-[#6]-[#6]-[#6]-[#6]-[#6]-[#6]-[#6](=O)-[#7]-[#6@@H](-[#6]-[#6]-[#6]\[#7]=[#6](/[#7])-[#7])-[#6](=O)-[#7]-[#6@@H](-[#6](-[#6])-[#6])-[#6](=O)-[#7]-[#6@@H](-[#6]-[#6]-[#6]-[#6]-[#7])-[#6](=O)-[#7]-[#6]-c1ccc(cc1)-[#6](-[#7])=[#7]