Reaction Details
TargetMu-type opioid receptor
LigandBDBM50303850
Substrate/Competitorn/a
Meas. Tech.ChEMBL_594975 (CHEMBL1038966)
Ki>10000±n/a nM
Citation Hsin, LWChang, LTRothman, RBDersch, CMFishback, JAMatsumoto, RR Synthesis and opioid activity of enantiomeric N-substituted 2,3,4,4a,5,6,7,7a-octahydro-1H-benzofuro[3,2-e]isoquinolines. J Med Chem53:1392-6 (2010) 
 
Mu-type opioid receptor
Name:Mu-type opioid receptor
Type:G Protein-Coupled Receptor (GPCR)
Mol. Mass.:44789.51
Organism:Homo sapiens (Human)
Description:P35372
Residue:400
BDBM50303850
NameBDBM50303850
Synonyms:(+)-trans-3-Cyclopropylmethyl-9-methoxy-2,3,4,4aalpha,5,6,7,7aalpha-octahydro-1H-benzo[4,5]furo[3,2-e]isoquinoline CHEMBL583881
TypeSmall organic molecule
Emp. Form.C20H27NO2
Mol. Mass.313.4339
SMILESCOc1cccc2c1O[C@H]1CCC[C@H]3CN(CC4CC4)CC[C@]213