Reaction Details
TargetSigma non-opioid intracellular receptor 1
LigandBDBM50303853
Substrate/Competitorn/a
Meas. Tech.ChEMBL_594980 (CHEMBL1039838)
Ki 560±n/a nM
Citation Hsin, LWChang, LTRothman, RBDersch, CMFishback, JAMatsumoto, RR Synthesis and opioid activity of enantiomeric N-substituted 2,3,4,4a,5,6,7,7a-octahydro-1H-benzofuro[3,2-e]isoquinolines. J Med Chem53:1392-6 (2010) 
 
Sigma non-opioid intracellular receptor 1
Name:Sigma non-opioid intracellular receptor 1
Type:Enzyme Catalytic Domain
Mol. Mass.:25266.54
Organism:RAT
Description:Q9R0C9
Residue:223
BDBM50303853
NameBDBM50303853
Synonyms:(+)-trans-9-Methoxy-3-(2-phenylethyl)-2,3,4,4aalpha,5,6,7,7aalpha-octahydro-1H-benzo[4,5]furo[3,2-e]isoquinoline CHEMBL571862
TypeSmall organic molecule
Emp. Form.C24H29NO2
Mol. Mass.363.4926
SMILESCOc1cccc2c1O[C@H]1CCC[C@H]3CN(CCc4ccccc4)CC[C@]213