Reaction Details
TargetKappa-type opioid receptor
LigandBDBM50303848
Substrate/Competitorn/a
Meas. Tech.ChEMBL_594974 (CHEMBL1038965)
Ki 14.0±n/a nM
Citation Hsin, LWChang, LTRothman, RBDersch, CMFishback, JAMatsumoto, RR Synthesis and opioid activity of enantiomeric N-substituted 2,3,4,4a,5,6,7,7a-octahydro-1H-benzofuro[3,2-e]isoquinolines. J Med Chem53:1392-6 (2010) 
 
Kappa-type opioid receptor
Name:Kappa-type opioid receptor
Type:G Protein-Coupled Receptor (GPCR)
Mol. Mass.:42648.76
Organism:Homo sapiens (Human)
Description:P41145
Residue:380
BDBM50303848
NameBDBM50303848
Synonyms:(+)-trans-3-Methyl-2,3,4,4aalpha,5,6,7,7aalpha-octahydro-1H-benzo-[4,5]furo[3,2-e]isoquinolin-9-ol CHEMBL571843 | US10231963, Table B.12
TypeSmall organic molecule
Emp. Form.C16H21NO2
Mol. Mass.259.3434
SMILESCN1CC[C@]23[C@H](CCC[C@H]2C1)Oc1c3cccc1O