Reaction Details
TargetKappa-type opioid receptor
LigandBDBM50303852
Substrate/Competitorn/a
Meas. Tech.ChEMBL_594974 (CHEMBL1038965)
Ki 15±n/a nM
Citation Hsin, LWChang, LTRothman, RBDersch, CMFishback, JAMatsumoto, RR Synthesis and opioid activity of enantiomeric N-substituted 2,3,4,4a,5,6,7,7a-octahydro-1H-benzofuro[3,2-e]isoquinolines. J Med Chem53:1392-6 (2010) 
 
Kappa-type opioid receptor
Name:Kappa-type opioid receptor
Type:G Protein-Coupled Receptor (GPCR)
Mol. Mass.:42648.76
Organism:Homo sapiens (Human)
Description:P41145
Residue:380
BDBM50303852
NameBDBM50303852
Synonyms:(+)-trans-3-(2-Phenylethyl)-2,3,4,4aalpha,5,6,7,7aalpha-octahydro-1Hbenzo[4,5]furo[3,2-e]isoquinolin-9-ol CHEMBL585721
TypeSmall organic molecule
Emp. Form.C23H27NO2
Mol. Mass.349.466
SMILESOc1cccc2c1O[C@H]1CCC[C@H]3CN(CCc4ccccc4)CC[C@]213