Reaction Details
TargetNeuropeptide Y receptor type 5
LigandBDBM50304299
Substrate/Competitorn/a
Meas. Tech.ChEMBL_606463 (CHEMBL1074028)
IC50 2.2±n/a nM
Citation Haga, YSakamoto, TShibata, TNonoshita, KIshikawa, MSuga, TTakahashi, HTakahashi, TTakahashi, HAndo, MMurai, TGomori, AOda, ZKitazawa, HMitobe, YKanesaka, MOhe, TIwaasa, HIshii, YIshihara, AKanatani, AFukami, T Discovery of trans-N-[1-(2-fluorophenyl)-3-pyrazolyl]-3-oxospiro[6-azaisobenzofuran-1(3H),1'-cyclohexane]-4'-carboxamide, a potent and orally active neuropeptide Y Y5 receptor antagonist. Bioorg Med Chem17:6971-82 (2009) 
 
Neuropeptide Y receptor type 5
Name:Neuropeptide Y receptor type 5
Type:Enzyme Catalytic Domain
Mol. Mass.:50435.58
Organism:Rat 6B
Description:NPY-Y5 NPY5R Rat 6B::Q63634
Residue:445
BDBM50304299
NameBDBM50304299
Synonyms:CHEMBL595560 | trans-3-Oxo-N-(1-phenyl-1H-pyrazol-3-yl)-3H-spiro[6-aza-2-benzofuran-1,1'-cyclohexane]-4'-carboxamide
TypeSmall organic molecule
Emp. Form.C22H20N4O3
Mol. Mass.388.4192
SMILESO=C(Nc1ccn(n1)-c1ccccc1)[C@H]1CC[C@@]2(CC1)OC(=O)c1ccncc21