Reaction Details
TargetNeuropeptide Y receptor type 5
LigandBDBM50304315
Substrate/Competitorn/a
Meas. Tech.ChEMBL_606453 (CHEMBL1074018)
IC50 0.89±n/a nM
Citation Haga, YSakamoto, TShibata, TNonoshita, KIshikawa, MSuga, TTakahashi, HTakahashi, TTakahashi, HAndo, MMurai, TGomori, AOda, ZKitazawa, HMitobe, YKanesaka, MOhe, TIwaasa, HIshii, YIshihara, AKanatani, AFukami, T Discovery of trans-N-[1-(2-fluorophenyl)-3-pyrazolyl]-3-oxospiro[6-azaisobenzofuran-1(3H),1'-cyclohexane]-4'-carboxamide, a potent and orally active neuropeptide Y Y5 receptor antagonist. Bioorg Med Chem17:6971-82 (2009) 
 
Neuropeptide Y receptor type 5
Name:Neuropeptide Y receptor type 5
Type:Enzyme
Mol. Mass.:50746.64
Organism:Homo sapiens (Human)
Description:Q15761
Residue:445
BDBM50304315
NameBDBM50304315
Synonyms:CHEMBL593465 | trans-3-Oxo-N-(2-phenyl-2H-1,2,3-triazol-4-yl)-3Hspiro[6-aza-2-benzofuran-1,1'-cyclohexane]-4'-carboxamide
TypeSmall organic molecule
Emp. Form.C21H19N5O3
Mol. Mass.389.4073
SMILESO=C(Nc1cnn(n1)-c1ccccc1)[C@H]1CC[C@@]2(CC1)OC(=O)c1ccncc21