Reaction Details
TargetNeuropeptide Y receptor type 5
LigandBDBM50304316
Substrate/Competitorn/a
Meas. Tech.ChEMBL_606453 (CHEMBL1074018)
IC50 2±n/a nM
Citation Haga, YSakamoto, TShibata, TNonoshita, KIshikawa, MSuga, TTakahashi, HTakahashi, TTakahashi, HAndo, MMurai, TGomori, AOda, ZKitazawa, HMitobe, YKanesaka, MOhe, TIwaasa, HIshii, YIshihara, AKanatani, AFukami, T Discovery of trans-N-[1-(2-fluorophenyl)-3-pyrazolyl]-3-oxospiro[6-azaisobenzofuran-1(3H),1'-cyclohexane]-4'-carboxamide, a potent and orally active neuropeptide Y Y5 receptor antagonist. Bioorg Med Chem17:6971-82 (2009) 
 
Neuropeptide Y receptor type 5
Name:Neuropeptide Y receptor type 5
Type:Enzyme
Mol. Mass.:50746.64
Organism:Homo sapiens (Human)
Description:Q15761
Residue:445
BDBM50304316
NameBDBM50304316
Synonyms:CHEMBL594164 | trans-N-[1-(4-Fluorophenyl)-1H-pyrazol-3-yl]-3-oxo-3Hspiro[6-aza-2-benzofuran-1,1'-cyclohexane]-4'-carboxamide
TypeSmall organic molecule
Emp. Form.C22H19FN4O3
Mol. Mass.406.4097
SMILESFc1cccc(c1)-n1ccc(NC(=O)[C@H]2CC[C@@]3(CC2)OC(=O)c2ccncc32)n1